Reaction Details
TargetTyrosine-protein kinase SYK
LigandBDBM100350
Substrate/Competitorn/a
Meas. Tech.Ambit KinomeScan Assay
Kd 4.5±n/a nM
Citation Bauer, SMPandey, A Inhibitors of protein kinases US Patent US8937070 Publication Date 1/20/2015
 
Tyrosine-protein kinase SYK
Name:Tyrosine-protein kinase SYK
Type:Enzyme
Mol. Mass.:72079.99
Organism:Homo sapiens (Human)
Description:P43405
Residue:635
BDBM100350
NameBDBM100350
Synonyms:US10533001, Example 99 US8501944, 372 US9868729, Example 99
TypeSmall organic molecule
Emp. Form.C19H25N7O3S
Mol. Mass.431.512
SMILESCS(=O)(=O)N1CCN(CC1)c1ccc(Nc2ncc(C(N)=O)c(NC3CC3)n2)cc1