Reaction Details
TargetTyrosine-protein kinase SYK
LigandBDBM100351
Substrate/Competitorn/a
Meas. Tech.Ambit KinomeScan Assay
Kd 9.4±n/a nM
Citation Bauer, SMPandey, A Inhibitors of protein kinases US Patent US8937070 Publication Date 1/20/2015
 
Tyrosine-protein kinase SYK
Name:Tyrosine-protein kinase SYK
Type:Enzyme
Mol. Mass.:72079.99
Organism:Homo sapiens (Human)
Description:P43405
Residue:635
BDBM100351
NameBDBM100351
Synonyms:US10533001, Example Table 9a.4 US8501944, 373 US9868729, Example 254
TypeSmall organic molecule
Emp. Form.C20H25N7O2
Mol. Mass.395.4582
SMILESNC(=O)[C@@H]1CCCN(C1)c1ccc(Nc2ncc(C(N)=O)c(NC3CC3)n2)cc1