Reaction Details
TargetTyrosine-protein kinase BTK
LigandBDBM143323
Substrate/Competitorn/a
Meas. Tech.HTRF Assay
IC50 2.4±n/a nM
Citation Bosanac, TDisalvo, DHoran, JCLiang, SZindell, RM Heteroaromatic compounds as BTK inhibitors US Patent US8940893 Publication Date 1/27/2015
 
Tyrosine-protein kinase BTK
Name:Tyrosine-protein kinase BTK
Type:Enzyme
Mol. Mass.:76289.95
Organism:Homo sapiens (Human)
Description:Q06187
Residue:659
BDBM143323
NameBDBM143323
Synonyms:US8940893, 8
TypeSmall organic molecule
Emp. Form.C25H23N7O2
Mol. Mass.453.4958
SMILESNc1ncnc2n(nc(-c3ccc(Oc4ccccc4)nc3)c12)C1CC2(C1)CN(C2)C(=O)C=C