Reaction Details
TargetGamma-aminobutyric acid receptor subunit alpha-2
LigandBDBM144259
Substrate/Competitorn/a
Meas. Tech.Radioligand Competition Binding Assay
Ki 18.2±n/a nM
Citation Omoto, KOwen, RMPryde, DCWatson, CATakeuchi, M Chemical compounds US Patent US8952008 Publication Date 2/10/2015
 
Gamma-aminobutyric acid receptor subunit alpha-2
Name:Gamma-aminobutyric acid receptor subunit alpha-2
Type:Protein
Mol. Mass.:51338.78
Organism:Homo sapiens (Human)
Description:P47869
Residue:451
BDBM144259
NameBDBM144259
Synonyms:US8952008, 15
TypeSmall organic molecule
Emp. Form.C21H18F2N4O2S
Mol. Mass.428.455
SMILESCCn1cnc2c(cnnc12)-c1ccc(F)c(c1)-c1ccc(cc1F)S(=O)(=O)CC