Reaction Details
TargetGamma-aminobutyric acid receptor subunit alpha-2
LigandBDBM144232
Substrate/Competitorn/a
Meas. Tech.Radioligand Competition Binding Assay
Ki 31.1±n/a nM
Citation Omoto, KOwen, RMPryde, DCWatson, CATakeuchi, M Chemical compounds US Patent US8952008 Publication Date 2/10/2015
 
Gamma-aminobutyric acid receptor subunit alpha-2
Name:Gamma-aminobutyric acid receptor subunit alpha-2
Type:Protein
Mol. Mass.:51338.78
Organism:Homo sapiens (Human)
Description:P47869
Residue:451
BDBM144232
NameBDBM144232
Synonyms:US8952008, 19
TypeSmall organic molecule
Emp. Form.C22H19FN4O2S
Mol. Mass.422.475
SMILESCCS(=O)(=O)c1ccc(cc1)-c1cc(ccc1F)-c1cnnc2n(cnc12)C1CC1