Reaction Details
TargetGamma-aminobutyric acid receptor subunit alpha-2
LigandBDBM144262
Substrate/Competitorn/a
Meas. Tech.Radioligand Competition Binding Assay
Ki 19±n/a nM
Citation Omoto, KOwen, RMPryde, DCWatson, CATakeuchi, M Chemical compounds US Patent US8952008 Publication Date 2/10/2015
 
Gamma-aminobutyric acid receptor subunit alpha-2
Name:Gamma-aminobutyric acid receptor subunit alpha-2
Type:Protein
Mol. Mass.:51338.78
Organism:Homo sapiens (Human)
Description:P47869
Residue:451
BDBM144262
NameBDBM144262
Synonyms:US8952008, 20
TypeSmall organic molecule
Emp. Form.C21H18FN5O2S
Mol. Mass.423.463
SMILESCNS(=O)(=O)c1ccc(cc1)-c1cc(ccc1F)-c1cnnc2n(cnc12)C1CC1