Reaction Details
TargetProtein-arginine deiminase type-6
LigandBDBM144277
Substrate/Competitorn/a
Meas. Tech.Colorimetric Assay
Temperature310.15±n/a K
IC50 3500±n/a nM
Commentsextracted
Citation Chen, GWang, YLi, PHu, JWang, SWang, Y Therapeutic compositions and methods US Patent US8969333 Publication Date 3/3/2015
 
Protein-arginine deiminase type-6
Name:Protein-arginine deiminase type-6
Type:Enzyme
Mol. Mass.:77711.47
Organism:Homo sapiens (Human)
Description:Q6TGC4
Residue:694
BDBM144277
NameBDBM144277
Synonyms:US8969333, YW3-56
TypeSmall organic molecule
Emp. Form.C27H32ClN5O2
Mol. Mass.494.028
SMILESCN(C)c1ccc2cc(ccc2c1)C(=O)N[C@@H](CCCNC(=N)CCl)C(=O)NCc1ccccc1