Reaction Details
TargetD(2) dopamine receptor
LigandBDBM144759
Substrate/Competitorn/a
Meas. Tech.Radioligand Binding Assay
pH7.6±n/a
Ki 67.6±n/a nM
Commentsextracted
Citation Dong, ZXShen, YKim, SH Somatostatin-dopamine chimeric analogs US Patent US8952128 Publication Date 2/10/2015
 
D(2) dopamine receptor
Name:D(2) dopamine receptor
Type:Cell-surface receptors
Mol. Mass.:50647.10
Organism:Homo sapiens (Human)
Description:P14416
Residue:443
BDBM144759
NameBDBM144759
Synonyms:US8952128, 17
TypeSmall organic molecule
Emp. Form.C101H133N21O13S2
Mol. Mass.1913.4
SMILESC[C@@H](O)[C@@H]1NC(=O)[C@H](CCCCN)NC(=O)[C@@H](Cc2c[nH]c3ccccc23)NC(=O)[C@H](Cc2ccncc2)NC(=O)[C@H](Cc2ccccc2)NC(=O)[C@H](CCCNC(N)=N)NC(=O)[C@@H](CCCCNC(=O)[C@H](Cc2ccccc2)NC1=O)NC[C@H](CCCCNC(=O)CS(=O)C[C@@H]1C[C@H]2[C@@H](Cc3c[nH]c4cccc2c34)N(C)C1)NC(=O)CS(=O)C[C@@H]1C[C@H]2[C@@H](Cc3c[nH]c4cccc2c34)N(C)C1