Reaction Details
TargetApoptosis regulator Bcl-2
LigandBDBM145014
Substrate/Competitorn/a
Meas. Tech.Time Resolved-Fluorescence Resonance Energy Transfer (TR-FRET) Assay
Temperature298.15±n/a K
Ki 0.01±n/a nM
Commentsextracted
Citation Ding, HDoherty, GAElmore, SWHexamer, LKunzer, ARPark, CSong, XSouers, AJSullivan, GMTao, ZWang, LWendt, MDCzabotar, PELessene, GLColman, PM Apoptosis-inducing agents for the treatment of cancer and immune and autoimmune diseases US Patent US8952157 Publication Date 2/10/2015
 
Apoptosis regulator Bcl-2
Name:Apoptosis regulator Bcl-2
Type:Homodimer or heterodimer
Mol. Mass.:26269.11
Organism:Homo sapiens (Human)
Description:P10415
Residue:239
BDBM145014
NameBDBM145014
Synonyms:US8952157, 201 | US9303025, 201
TypeSmall organic molecule
Emp. Form.C50H56ClF2N7O7S
Mol. Mass.972.537
SMILESCC1(C)CCC(CN2CCN(CC2)c2ccc(C(=O)NS(=O)(=O)c3ccc(NC4CCN(CC4)C4CCOCC4)c(c3)[N+]([O-])=O)c(Oc3cc4cc[nH]c4c(F)c3F)c2)=C(C1)c1ccc(Cl)cc1