Reaction Details
TargetSodium channel protein type 9 subunit alpha
LigandBDBM145246
Substrate/Competitorn/a
Meas. Tech.Radioligand Binding Assay
pH7.4±n/a
Temperature298.15±n/a K
IC50 220±n/a nM
Commentsextracted
Citation Andrez, JChowdhury, SDecker, SMDehnhardt, CMFocken, TGrimwood, MEHemeon, IWJia, QLi, JOrtwine, DFSafina, BSheng, TSun, SSutherlin, DPWilson, MSZenova, AY N-substituted benzamides and methods of use thereof US Patent US8952169 Publication Date 2/10/2015
 
Sodium channel protein type 9 subunit alpha
Name:Sodium channel protein type 9 subunit alpha
Type:Protein
Mol. Mass.:226375.97
Organism:Homo sapiens (Human)
Description:Q15858
Residue:1988
BDBM145246
NameBDBM145246
Synonyms:BDBM342437 | US8952169, 25
TypeSmall organic molecule
Emp. Form.C18H23ClFNO4S
Mol. Mass.403.896
SMILESCC1(C)[C@@H]2CC[C@@]1(C)[C@H](C2)Oc1cc(F)c(cc1Cl)C(=O)NS(C)(=O)=O