Reaction Details
TargetSodium channel protein type 9 subunit alpha
LigandBDBM145387
Substrate/Competitorn/a
Meas. Tech.Radioligand Binding Assay
pH7.4±n/a
Temperature298.15±n/a K
IC50 27±n/a nM
Commentsextracted
Citation Andrez, JChowdhury, SDecker, SMDehnhardt, CMFocken, TGrimwood, MEHemeon, IWJia, QLi, JOrtwine, DFSafina, BSheng, TSun, SSutherlin, DPWilson, MSZenova, AY N-substituted benzamides and methods of use thereof US Patent US8952169 Publication Date 2/10/2015
 
Sodium channel protein type 9 subunit alpha
Name:Sodium channel protein type 9 subunit alpha
Type:Protein
Mol. Mass.:226375.97
Organism:Homo sapiens (Human)
Description:Q15858
Residue:1988
BDBM145387
NameBDBM145387
Synonyms:US8952169, 166 | US9771376, Example 166
TypeSmall organic molecule
Emp. Form.C18H22F3NO4S
Mol. Mass.405.432
SMILESCS(=O)(=O)NC(=O)c1cc(C2CC2)c(OCC2CCC(F)(F)CC2)cc1F