Reaction Details
TargetSodium channel protein type 9 subunit alpha
LigandBDBM145235
Substrate/Competitorn/a
Meas. Tech.Electrophysiological Assay
Temperature310.15±n/a K
IC50 37.7±n/a nM
Commentsextracted
Citation Andrez, JChowdhury, SDecker, SMDehnhardt, CMFocken, TGrimwood, MEHemeon, IWJia, QLi, JOrtwine, DFSafina, BSheng, TSun, SSutherlin, DPWilson, MSZenova, AY N-substituted benzamides and methods of use thereof US Patent US8952169 Publication Date 2/10/2015
 
Sodium channel protein type 9 subunit alpha
Name:Sodium channel protein type 9 subunit alpha
Type:Protein
Mol. Mass.:226375.97
Organism:Homo sapiens (Human)
Description:Q15858
Residue:1988
BDBM145235
NameBDBM145235
Synonyms:US8952169, 14 | US9771376, Example 14
TypeSmall organic molecule
Emp. Form.C18H23ClFNO4S
Mol. Mass.403.896
SMILESC[C@H]1[C@@H]2C[C@H](C[C@@H]1Oc1cc(F)c(cc1Cl)C(=O)NS(C)(=O)=O)C2(C)C