Reaction Details
TargetSodium channel protein type 9 subunit alpha
LigandBDBM145412
Substrate/Competitorn/a
Meas. Tech.Electrophysiological Assay
Temperature310.15±n/a K
IC50 9±n/a nM
Commentsextracted
Citation Andrez, JChowdhury, SDecker, SMDehnhardt, CMFocken, TGrimwood, MEHemeon, IWJia, QLi, JOrtwine, DFSafina, BSheng, TSun, SSutherlin, DPWilson, MSZenova, AY N-substituted benzamides and methods of use thereof US Patent US8952169 Publication Date 2/10/2015
 
Sodium channel protein type 9 subunit alpha
Name:Sodium channel protein type 9 subunit alpha
Type:Protein
Mol. Mass.:226375.97
Organism:Homo sapiens (Human)
Description:Q15858
Residue:1988
BDBM145412
NameBDBM145412
Synonyms:US8952169, 191
TypeSmall organic molecule
Emp. Form.C24H31FN2O4S
Mol. Mass.462.577
SMILESFc1cc(OCC2C3CC4CC(C3)CC2C4)c(cc1C(=O)NS(=O)(=O)N1CCC1)C1CC1