Reaction Details
TargetSodium channel protein type 9 subunit alpha
LigandBDBM145366
Substrate/Competitorn/a
Meas. Tech.Electrophysiological Assay
Temperature310.15±n/a K
IC50 3.6±n/a nM
Commentsextracted
Citation Andrez, JChowdhury, SDecker, SMDehnhardt, CMFocken, TGrimwood, MEHemeon, IWJia, QLi, JOrtwine, DFSafina, BSheng, TSun, SSutherlin, DPWilson, MSZenova, AY N-substituted benzamides and methods of use thereof US Patent US8952169 Publication Date 2/10/2015
 
Sodium channel protein type 9 subunit alpha
Name:Sodium channel protein type 9 subunit alpha
Type:Protein
Mol. Mass.:226375.97
Organism:Homo sapiens (Human)
Description:Q15858
Residue:1988
BDBM145366
NameBDBM145366
Synonyms:US8952169, 145 US9771376, Example 145
TypeSmall organic molecule
Emp. Form.C19H23ClFNO4S
Mol. Mass.415.907
SMILESCS(=O)(=O)NC(=O)c1cc(Cl)c(OCC2CC3C4CCC(C4)C3C2)cc1F