Reaction Details
TargetArachidonate 5-lipoxygenase-activating protein
LigandBDBM145657
Substrate/Competitorn/a
Meas. Tech.Homogeneous Time Resolved Fluorescence Assay
Ki 0.74±n/a nM
Citation Chai, WDvorak, CAEccles, WEdwards, JPGoldberg, SDKrawczuk, PJLebsack, ADLiu, JPippel, DJSales, ZSTanis, VMTichenor, MSWiener, JJ 1,2,6-substituted benzimidazoles as FLAP modulators US Patent US8952177 Publication Date 2/10/2015
 
Arachidonate 5-lipoxygenase-activating protein
Name:Arachidonate 5-lipoxygenase-activating protein
Type:Protein
Mol. Mass.:24212.61
Organism:Homo sapiens (Human)
Description:A0A087WW23
Residue:218
BDBM145657
NameBDBM145657
Synonyms:US8952177, 11 US9695149, 11
TypeSmall organic molecule
Emp. Form.C28H27BrFN3O3
Mol. Mass.552.435
SMILESCc1ccc(COc2ccc3nc([C@@H]4CCCC[C@@H]4C(O)=O)n(Cc4ccc(Br)cc4F)c3c2)nc1