Reaction Details
TargetArachidonate 5-lipoxygenase-activating protein
LigandBDBM145681
Substrate/Competitorn/a
Meas. Tech.Homogeneous Time Resolved Fluorescence Assay
Ki 1.9±n/a nM
Citation Chai, WDvorak, CAEccles, WEdwards, JPGoldberg, SDKrawczuk, PJLebsack, ADLiu, JPippel, DJSales, ZSTanis, VMTichenor, MSWiener, JJ 1,2,6-substituted benzimidazoles as FLAP modulators US Patent US8952177 Publication Date 2/10/2015
 
Arachidonate 5-lipoxygenase-activating protein
Name:Arachidonate 5-lipoxygenase-activating protein
Type:Protein
Mol. Mass.:24212.61
Organism:Homo sapiens (Human)
Description:A0A087WW23
Residue:218
BDBM145681
NameBDBM145681
Synonyms:US8952177, 35 US9695149, 35
TypeSmall organic molecule
Emp. Form.C35H32F3N3O3
Mol. Mass.599.6421
SMILESCc1ccc(COc2ccc3nc(C4CCCC[C@@H]4C(O)=O)n(Cc4ccc(cc4)-c4ccc(cc4)C(F)(F)F)c3c2)nc1