Reaction Details
TargetArachidonate 5-lipoxygenase-activating protein
LigandBDBM145731
Substrate/Competitorn/a
Meas. Tech.Homogeneous Time Resolved Fluorescence Assay
Ki 1.4±n/a nM
Citation Chai, WDvorak, CAEccles, WEdwards, JPGoldberg, SDKrawczuk, PJLebsack, ADLiu, JPippel, DJSales, ZSTanis, VMTichenor, MSWiener, JJ 1,2,6-substituted benzimidazoles as FLAP modulators US Patent US8952177 Publication Date 2/10/2015
 
Arachidonate 5-lipoxygenase-activating protein
Name:Arachidonate 5-lipoxygenase-activating protein
Type:Protein
Mol. Mass.:24212.61
Organism:Homo sapiens (Human)
Description:A0A087WW23
Residue:218
BDBM145731
NameBDBM145731
Synonyms:US8952177, 85 US9695149, 85
TypeSmall organic molecule
Emp. Form.C27H25F5N4O4
Mol. Mass.564.5038
SMILESCn1cc(F)c(COc2ccc3nc([C@@H]4CCCC[C@@H]4C(O)=O)n(Cc4ccc(OC(F)(F)F)cc4F)c3c2)n1