Reaction Details
TargetArachidonate 5-lipoxygenase-activating protein
LigandBDBM145769
Substrate/Competitorn/a
Meas. Tech.Homogeneous Time Resolved Fluorescence Assay
Ki 0.61±n/a nM
Citation Chai, WDvorak, CAEccles, WEdwards, JPGoldberg, SDKrawczuk, PJLebsack, ADLiu, JPippel, DJSales, ZSTanis, VMTichenor, MSWiener, JJ 1,2,6-substituted benzimidazoles as FLAP modulators US Patent US8952177 Publication Date 2/10/2015
 
Arachidonate 5-lipoxygenase-activating protein
Name:Arachidonate 5-lipoxygenase-activating protein
Type:Protein
Mol. Mass.:24212.61
Organism:Homo sapiens (Human)
Description:A0A087WW23
Residue:218
BDBM145769
NameBDBM145769
Synonyms:US8952177, 123 US9695149, 123
TypeSmall organic molecule
Emp. Form.C28H25BrF3N3O3
Mol. Mass.588.416
SMILESCc1cnc(COc2ccc3nc([C@@H]4CCCC[C@@H]4C(O)=O)n(Cc4c(F)cc(Br)cc4F)c3c2)c(F)c1