Reaction Details
TargetCyclin-dependent kinase 4
LigandBDBM146970
Substrate/Competitorn/a
Meas. Tech.Biological Assay
pH7.5±n/a
Temperature295.15±n/a K
IC50<4±n/a nM
Commentsextracted
Citation Brain, CTCho, YSGiraldes, JWLagu, BLevell, JRLuzzio, MJPerez, LBWang, YYang, F Pyrrolopyrimidine compounds as inhibitors of CDK4/6 US Patent US8957074 Publication Date 2/17/2015
 
Cyclin-dependent kinase 4
Name:Cyclin-dependent kinase 4
Type:Enzyme Subunit
Mol. Mass.:33731.96
Organism:Homo sapiens (Human)
Description:P11802
Residue:303
BDBM146970
NameBDBM146970
Synonyms:US8957074, 9
TypeSmall organic molecule
Emp. Form.C26H32N8O2
Mol. Mass.488.5847
SMILESCN(C)C(=O)c1cc2cnc(Nc3ccc(cn3)C(=O)N3CC4CNC(C4)C3)nc2n1C1CCCC1