Reaction Details
TargetCyclin-dependent kinase 4
LigandBDBM147048
Substrate/Competitorn/a
Meas. Tech.Biological Assay
pH7.5±n/a
Temperature295.15±n/a K
IC50 5±n/a nM
Commentsextracted
Citation Brain, CTCho, YSGiraldes, JWLagu, BLevell, JRLuzzio, MJPerez, LBWang, YYang, F Pyrrolopyrimidine compounds as inhibitors of CDK4/6 US Patent US8957074 Publication Date 2/17/2015
 
Cyclin-dependent kinase 4
Name:Cyclin-dependent kinase 4
Type:Enzyme Subunit
Mol. Mass.:33731.96
Organism:Homo sapiens (Human)
Description:P11802
Residue:303
BDBM147048
NameBDBM147048
Synonyms:US8957074, 88
TypeSmall organic molecule
Emp. Form.C28H36N8O2
Mol. Mass.516.6378
SMILESCN(C)C(=O)c1cc2cnc(Nc3ccc(cn3)N3C[C@H]4CNC[C@H]4CC3=O)nc2n1C1CCCCCC1