Reaction Details
TargetCyclin-dependent kinase 4
LigandBDBM147087
Substrate/Competitorn/a
Meas. Tech.Biological Assay
pH7.5±n/a
Temperature295.15±n/a K
IC50 5±n/a nM
Commentsextracted
Citation Brain, CTCho, YSGiraldes, JWLagu, BLevell, JRLuzzio, MJPerez, LBWang, YYang, F Pyrrolopyrimidine compounds as inhibitors of CDK4/6 US Patent US8957074 Publication Date 2/17/2015
 
Cyclin-dependent kinase 4
Name:Cyclin-dependent kinase 4
Type:Enzyme Subunit
Mol. Mass.:33731.96
Organism:Homo sapiens (Human)
Description:P11802
Residue:303
BDBM147087
NameBDBM147087
Synonyms:US8957074, 127
TypeSmall organic molecule
Emp. Form.C31H33N9O2
Mol. Mass.563.6528
SMILESCN(C)C(=O)c1cc2cnc(Nc3ccc(cn3)N3CC4CCC(CC3=O)N4)nc2n1-c1ccc(cc1)C(C)(C)C#N