Reaction Details
TargetMu-type opioid receptor
LigandBDBM147188
Substrate/Competitorn/a
Meas. Tech.Radioligand Dose-Displacement Binding Assay
pH7.4±n/a
Temperature323.15±n/a K
Ki 112.19±n/a nM
Commentsextracted
Citation Kyle, DJTafesse, LZhou, X 7,8-cyclicmorphinan analogs US Patent US8957084 Publication Date 2/17/2015
 
Mu-type opioid receptor
Name:Mu-type opioid receptor
Type:G Protein-Coupled Receptor (GPCR)
Mol. Mass.:44789.51
Organism:Homo sapiens (Human)
Description:P35372
Residue:400
BDBM147188
NameBDBM147188
Synonyms:US8957084, 1
TypeSmall organic molecule
Emp. Form.C22H27NO2
Mol. Mass.337.4553
SMILESCOc1ccc2C[C@@H]3C4C5CC5C(=O)C[C@]4(CCN3CC3CC3)c2c1