Reaction Details
TargetMu-type opioid receptor
LigandBDBM147190
Substrate/Competitorn/a
Meas. Tech.Radioligand Dose-Displacement Binding Assay
pH7.4±n/a
Temperature323.15±n/a K
Ki 30±n/a nM
Commentsextracted
Citation Kyle, DJTafesse, LZhou, X 7,8-cyclicmorphinan analogs US Patent US8957084 Publication Date 2/17/2015
 
Mu-type opioid receptor
Name:Mu-type opioid receptor
Type:G Protein-Coupled Receptor (GPCR)
Mol. Mass.:44789.51
Organism:Homo sapiens (Human)
Description:P35372
Residue:400
BDBM147190
NameBDBM147190
Synonyms:US8957084, 3
TypeSmall organic molecule
Emp. Form.C25H33NO2
Mol. Mass.379.535
SMILESCOc1ccc2C[C@@H]3C4C5CC5C(CC4(CCN3CC3CC3)c2c1)OCC=C