Reaction Details
TargetMu-type opioid receptor
LigandBDBM147192
Substrate/Competitorn/a
Meas. Tech.Radioligand Dose-Displacement Binding Assay
pH7.4±n/a
Temperature323.15±n/a K
Ki 241.8±n/a nM
Commentsextracted
Citation Kyle, DJTafesse, LZhou, X 7,8-cyclicmorphinan analogs US Patent US8957084 Publication Date 2/17/2015
 
Mu-type opioid receptor
Name:Mu-type opioid receptor
Type:G Protein-Coupled Receptor (GPCR)
Mol. Mass.:44789.51
Organism:Homo sapiens (Human)
Description:P35372
Residue:400
BDBM147192
NameBDBM147192
Synonyms:US8957084, 5
TypeSmall organic molecule
Emp. Form.C27H35NO2
Mol. Mass.405.5723
SMILESCOc1ccc2C[C@@H]3[C@@H]4[C@H]5C6CCC(CC6)[C@H]5C(=O)C[C@]4(CCN3CC3CC3)c2c1