Reaction Details
TargetKappa-type opioid receptor
LigandBDBM147188
Substrate/Competitorn/a
Meas. Tech.Radioligand Dose-Displacement Binding Assay
pH7.4±n/a
Temperature298.15±n/a K
Ki 8.87±n/a nM
Commentsextracted
Citation Kyle, DJTafesse, LZhou, X 7,8-cyclicmorphinan analogs US Patent US8957084 Publication Date 2/17/2015
 
Kappa-type opioid receptor
Name:Kappa-type opioid receptor
Type:G Protein-Coupled Receptor (GPCR)
Mol. Mass.:42648.76
Organism:Homo sapiens (Human)
Description:P41145
Residue:380
BDBM147188
NameBDBM147188
Synonyms:US8957084, 1
TypeSmall organic molecule
Emp. Form.C22H27NO2
Mol. Mass.337.4553
SMILESCOc1ccc2C[C@@H]3C4C5CC5C(=O)C[C@]4(CCN3CC3CC3)c2c1