Reaction Details
TargetPeroxisome proliferator-activated receptor gamma
LigandBDBM147434
Substrate/Competitorn/a
Meas. Tech.Lanthascreen Competitive Binding Assay
IC50<1±n/a nM
Citation Kamenecka, TMGriffin, PRKoenig, MAsteian, ABlayo, AHe, YShin, Y N-biphenylmethylindole modulators of PPARG US Patent US8957093 Publication Date 2/17/2015
 
Peroxisome proliferator-activated receptor gamma
Name:Peroxisome proliferator-activated receptor gamma
Type:Nuclear Receptor
Mol. Mass.:57613.46
Organism:Homo sapiens (Human)
Description:P37231
Residue:505
BDBM147434
NameBDBM147434
Synonyms:US8957093, 272
TypeSmall organic molecule
Emp. Form.C35H33N3O3
Mol. Mass.543.6548
SMILESCC(NC(=O)c1ccc2n(Cc3ccc(cc3)-c3ccccc3C(O)=O)c(C)c(C)c2c1)c1cccc(n1)C1CC1