Reaction Details
Target5-hydroxytryptamine receptor 5A
LigandBDBM148165
Substrate/Competitorn/a
Meas. Tech.Binding Assay
pH7.4±n/a
Temperature310.15±n/a K
Ki 0.88±n/a nM
Commentsextracted
Citation Hamaguchi, WKinoyama, IKoganemaru, YMiyazaki, TKaneko, OSekioka, RWashio, T Tetrahydroisoquinoline derivative US Patent US8962612 Publication Date 2/24/2015
 
5-hydroxytryptamine receptor 5A
Name:5-hydroxytryptamine receptor 5A
Type:Enzyme
Mol. Mass.:40266.25
Organism:Homo sapiens (Human)
Description:P47898
Residue:357
BDBM148165
NameBDBM148165
Synonyms:US8962612, 74
TypeSmall organic molecule
Emp. Form.C19H16F4N4O
Mol. Mass.392.3502
SMILESNC(N)=NC(=O)N1Cc2c(ccc(F)c2C2(CC2)C1)-c1c(F)cc(F)cc1F