Reaction Details
TargetcAMP and cAMP-inhibited cGMP 3',5'-cyclic phosphodiesterase 10A
LigandBDBM149484
Substrate/Competitorn/a
Meas. Tech.Fluorescence Polarization Assay
Ki 4.2±n/a nM
Citation Breslin, MJCox, CDHartingh, TJPero, JRaheem, ITRossi, MVassallo, L Aryloxmethyl cyclopropane derivatives as PDE10 inhibitors US Patent US8975261 Publication Date 3/10/2015
 
cAMP and cAMP-inhibited cGMP 3',5'-cyclic phosphodiesterase 10A
Name:cAMP and cAMP-inhibited cGMP 3',5'-cyclic phosphodiesterase 10A
Type:Protein
Mol. Mass.:88412.52
Organism:Homo sapiens (Human)
Description:Q9Y233
Residue:1055
BDBM149484
NameBDBM149484
Synonyms:US8975261, I-55
TypeSmall organic molecule
Emp. Form.C20H21N5O2S
Mol. Mass.395.478
SMILESCOc1ccc(nc1)[C@H]1C[C@@H]1COc1nc(C)ncc1-c1nnc(s1)C1CC1