Reaction Details
TargetSerine/threonine-protein kinase pim-2
LigandBDBM149686
Substrate/Competitorn/a
Meas. Tech.Kinase Inhibition Assay
pH7.5±n/a
IC50 24±n/a nM
Commentsextracted
Citation Caldarelli, MAngiolini, MBeria, IBrasca, MGCasuscelli, FD'Alessio, RLombardi Borgia, A Tricyclic pyrrolo derivatives, process for their preparation and their use as kinase inhibitors US Patent US8975267 Publication Date 3/10/2015
 
Serine/threonine-protein kinase pim-2
Name:Serine/threonine-protein kinase pim-2
Type:Serine/threonine-protein kinase
Mol. Mass.:34185.93
Organism:Homo sapiens (Human)
Description:Q9P1W9
Residue:311
BDBM149686
NameBDBM149686
Synonyms:US8975267, 22
TypeSmall organic molecule
Emp. Form.C15H18N4OS
Mol. Mass.302.395
SMILESCSc1ncc2CCc3c(cn(C(C)C)c3-c2n1)C(N)=O