Reaction Details
TargetCalmodulin-domain protein kinase 1
LigandBDBM50446177
Substrate/Competitorn/a
Meas. Tech.Luminescent Kinase Assay
IC50 4.00±n/a nM
Citation Fan, EVan Voorhis, WCZhang, ZHuang, WOjo, KK 5-aminopyrazole-4-carboxamide inhibitors of CDPK1 from T. gondii and C. parvum US Patent US9518026 Publication Date 12/13/2016
 
Calmodulin-domain protein kinase 1
Name:Calmodulin-domain protein kinase 1
Type:Enzyme Catalytic Domain
Mol. Mass.:57248.42
Organism:Toxoplasma gondii
Description:n/a
Residue:507
BDBM50446177
NameBDBM50446177
Synonyms:CHEMBL3108991 US9956214, Compound 18
TypeSmall organic molecule
Emp. Form.C16H13F3N4O
Mol. Mass.334.2958
SMILESNC(=O)c1c(N)n(CC(F)(F)F)nc1-c1ccc2ccccc2c1