Reaction Details
TargetUncharacterized protein
LigandBDBM50446171
Substrate/Competitorn/a
Meas. Tech.Luminescent Kinase Assay
IC50 10.00±n/a nM
Citation Fan, EVan Voorhis, WCZhang, ZHuang, WOjo, KK 5-aminopyrazole-4-carboxamide inhibitors of CDPK1 from T. gondii and C. parvum US Patent US9518026 Publication Date 12/13/2016
 
Uncharacterized protein
Name:Uncharacterized protein
Synonyms:Calmodulin-domain protein kinase (CDPK1)
Type:Enzyme Catalytic Domain
Mol. Mass.:60946.72
Organism:Cryptosporidium parvum
Description:n/a
Residue:538
BDBM50446171
NameBDBM50446171
TypeSmall organic molecule
Emp. Form.C21H26N4O2
Mol. Mass.366.4567
SMILESCCCOc1ccc2cc(ccc2c1)-c1nn(c(N)c1C(N)=O)C(C)(C)C