Reaction Details
TargetCalmodulin-domain protein kinase 1
LigandBDBM50148632
Substrate/Competitorn/a
Meas. Tech.Luminescent Kinase Assay
IC50 2.00±n/a nM
Citation Fan, EVan Voorhis, WCZhang, ZHuang, WOjo, KK 5-aminopyrazole-4-carboxamide inhibitors of CDPK1 from T. gondii and C. parvum US Patent US9518026 Publication Date 12/13/2016
 
Calmodulin-domain protein kinase 1
Name:Calmodulin-domain protein kinase 1
Type:Enzyme Catalytic Domain
Mol. Mass.:57248.42
Organism:Toxoplasma gondii
Description:n/a
Residue:507
BDBM50148632
NameBDBM50148632
Synonyms:CHEMBL3770409 US9956214, Compound 1572
TypeSmall organic molecule
Emp. Form.C18H21N5O2
Mol. Mass.339.3916
SMILESCCOc1ccc2cc(cnc2c1)-c1nn(C(C)C)c(N)c1C(N)=O