Reaction Details
TargetCalmodulin-domain protein kinase 1
LigandBDBM50148653
Substrate/Competitorn/a
Meas. Tech.Luminescent Kinase Assay
IC50 4.00±n/a nM
Citation Fan, EVan Voorhis, WCZhang, ZHuang, WOjo, KK 5-aminopyrazole-4-carboxamide inhibitors of CDPK1 from T. gondii and C. parvum US Patent US9518026 Publication Date 12/13/2016
 
Calmodulin-domain protein kinase 1
Name:Calmodulin-domain protein kinase 1
Type:Enzyme Catalytic Domain
Mol. Mass.:57248.42
Organism:Toxoplasma gondii
Description:n/a
Residue:507
BDBM50148653
NameBDBM50148653
Synonyms:CHEMBL3771104 US9956214, Compound 1632
TypeSmall organic molecule
Emp. Form.C22H27N5O2
Mol. Mass.393.4821
SMILESCCOc1ccc2cc(ccc2n1)-c1nn(C2CCCCCC2)c(N)c1C(N)=O