Reaction Details
TargetCoagulation factor IX
LigandBDBM150286
Substrate/Competitorn/a
Meas. Tech.Inhibition Assay
pH8±n/a
Temperature298.15±n/a K
IC50 20±n/a nM
Commentsextracted
Citation Chackalamannil, SChan, TChelliah, MVClasby, MCDwyer, MGreenlee, WJHirabayashi, TNeelamkavil, SNishida, HSaitoh, FShah, UXia, Y Morpholinone compounds as factor IXA inhibitors US Patent US8987242 Publication Date 3/24/2015
 
Coagulation factor IX
Name:Coagulation factor IX
Type:Enzyme
Mol. Mass.:51768.83
Organism:Homo sapiens (Human)
Description:P00740
Residue:461
BDBM150286
NameBDBM150286
Synonyms:US8987242, 62
TypeSmall organic molecule
Emp. Form.C22H22N4O4
Mol. Mass.406.4345
SMILESCc1ccc(cc1)N1CCO[C@H]([C@@H](O)C(=O)Nc2ccc3c(N)nccc3c2)C1=O