Reaction Details
TargetPhosphatidylinositol 4,5-bisphosphate 3-kinase catalytic subunit alpha isoform
LigandBDBM150997
Substrate/Competitorn/a
Meas. Tech.Kinase Assay
pH7.5±n/a
Temperature277.15±n/a K
IC50 720±n/a nM
Commentsextracted
Citation Radetich, BYu, BZhu, Y Heterocyclic derivatives US Patent US8987257 Publication Date 3/24/2015
 
Phosphatidylinositol 4,5-bisphosphate 3-kinase catalytic subunit alpha isoform
Name:Phosphatidylinositol 4,5-bisphosphate 3-kinase catalytic subunit alpha isoform
Type:Enzyme Subunit
Mol. Mass.:124294.87
Organism:Homo sapiens (Human)
Description:P42336
Residue:1068
BDBM150997
NameBDBM150997
Synonyms:US8987257, 10
TypeSmall organic molecule
Emp. Form.C21H25ClN6O3
Mol. Mass.444.915
SMILESC[C@H]1COCCN1c1nc(nc2[nH]c(nc12)-c1cc(CO)ccc1Cl)N1CCOCC1