Reaction Details
TargetPhosphatidylinositol 4,5-bisphosphate 3-kinase catalytic subunit alpha isoform
LigandBDBM151000
Substrate/Competitorn/a
Meas. Tech.Kinase Assay
pH7.5±n/a
Temperature277.15±n/a K
IC50 430±n/a nM
Commentsextracted
Citation Radetich, BYu, BZhu, Y Heterocyclic derivatives US Patent US8987257 Publication Date 3/24/2015
 
Phosphatidylinositol 4,5-bisphosphate 3-kinase catalytic subunit alpha isoform
Name:Phosphatidylinositol 4,5-bisphosphate 3-kinase catalytic subunit alpha isoform
Type:Enzyme Subunit
Mol. Mass.:124294.87
Organism:Homo sapiens (Human)
Description:P42336
Residue:1068
BDBM151000
NameBDBM151000
Synonyms:US8987257, 13
TypeSmall organic molecule
Emp. Form.C21H24N8O2
Mol. Mass.420.4677
SMILESC[C@H]1COCCN1c1nc(nc2[nH]c(nc12)-c1cnc2cc[nH]c2c1)N1CCOCC1