Reaction Details
TargetPhosphatidylinositol 4,5-bisphosphate 3-kinase catalytic subunit alpha isoform
LigandBDBM151002
Substrate/Competitorn/a
Meas. Tech.Kinase Assay
pH7.5±n/a
Temperature277.15±n/a K
IC50 4580±n/a nM
Commentsextracted
Citation Radetich, BYu, BZhu, Y Heterocyclic derivatives US Patent US8987257 Publication Date 3/24/2015
 
Phosphatidylinositol 4,5-bisphosphate 3-kinase catalytic subunit alpha isoform
Name:Phosphatidylinositol 4,5-bisphosphate 3-kinase catalytic subunit alpha isoform
Type:Enzyme Subunit
Mol. Mass.:124294.87
Organism:Homo sapiens (Human)
Description:P42336
Residue:1068
BDBM151002
NameBDBM151002
Synonyms:US8987257, 15
TypeSmall organic molecule
Emp. Form.C23H27N7O2
Mol. Mass.433.5062
SMILESC[C@@H]1COCCN1c1nc(N2CCOC[C@H]2C)c2nc([nH]c2n1)-c1cccc2[nH]ccc12