Reaction Details
TargetPhosphatidylinositol 4,5-bisphosphate 3-kinase catalytic subunit alpha isoform
LigandBDBM151018
Substrate/Competitorn/a
Meas. Tech.Kinase Assay
pH7.5±n/a
Temperature277.15±n/a K
IC50 590±n/a nM
Commentsextracted
Citation Radetich, BYu, BZhu, Y Heterocyclic derivatives US Patent US8987257 Publication Date 3/24/2015
 
Phosphatidylinositol 4,5-bisphosphate 3-kinase catalytic subunit alpha isoform
Name:Phosphatidylinositol 4,5-bisphosphate 3-kinase catalytic subunit alpha isoform
Type:Enzyme Subunit
Mol. Mass.:124294.87
Organism:Homo sapiens (Human)
Description:P42336
Residue:1068
BDBM151018
NameBDBM151018
Synonyms:US8987257, 31
TypeSmall organic molecule
Emp. Form.C22H25N7O2
Mol. Mass.419.4796
SMILESCc1cc2c(cccc2[nH]1)-c1nc2c(nc(nc2[nH]1)N1CCOCC1)N1CCOCC1