Reaction Details
TargetSerine/threonine-protein kinase mTOR
LigandBDBM150990
Substrate/Competitorn/a
Meas. Tech.TR-FRET Tracer Assay
pH7.5±n/a
Temperature298.15±n/a K
IC50 510±n/a nM
Commentsextracted
Citation Radetich, BYu, BZhu, Y Heterocyclic derivatives US Patent US8987257 Publication Date 3/24/2015
 
Serine/threonine-protein kinase mTOR
Name:Serine/threonine-protein kinase mTOR
Type:Rapamycin target protein
Mol. Mass.:288917.12
Organism:Homo sapiens (Human)
Description:P42345
Residue:2549
BDBM150990
NameBDBM150990
Synonyms:US8987257, 3
TypeSmall organic molecule
Emp. Form.C22H26N8O2
Mol. Mass.434.4942
SMILESC[C@H]1COCCN1c1nc(N2CCOC[C@@H]2C)c2nc([nH]c2n1)-c1ccnc2[nH]ccc12