Reaction Details
TargetSerine/threonine-protein kinase mTOR
LigandBDBM150993
Substrate/Competitorn/a
Meas. Tech.TR-FRET Tracer Assay
pH7.5±n/a
Temperature298.15±n/a K
IC50 30±n/a nM
Commentsextracted
Citation Radetich, BYu, BZhu, Y Heterocyclic derivatives US Patent US8987257 Publication Date 3/24/2015
 
Serine/threonine-protein kinase mTOR
Name:Serine/threonine-protein kinase mTOR
Type:Rapamycin target protein
Mol. Mass.:288917.12
Organism:Homo sapiens (Human)
Description:P42345
Residue:2549
BDBM150993
NameBDBM150993
Synonyms:US8987257, 6
TypeSmall organic molecule
Emp. Form.C22H26N8O3
Mol. Mass.450.4936
SMILESC[C@H]1COCCN1c1nc(N2CCOC[C@@H]2C)c2nc([nH]c2n1)-c1ccc2[nH]c(=O)[nH]c2c1