Reaction Details
TargetSerine/threonine-protein kinase mTOR
LigandBDBM150996
Substrate/Competitorn/a
Meas. Tech.TR-FRET Tracer Assay
pH7.5±n/a
Temperature298.15±n/a K
IC50 3204±n/a nM
Commentsextracted
Citation Radetich, BYu, BZhu, Y Heterocyclic derivatives US Patent US8987257 Publication Date 3/24/2015
 
Serine/threonine-protein kinase mTOR
Name:Serine/threonine-protein kinase mTOR
Type:Rapamycin target protein
Mol. Mass.:288917.12
Organism:Homo sapiens (Human)
Description:P42345
Residue:2549
BDBM150996
NameBDBM150996
Synonyms:US8987257, 9
TypeSmall organic molecule
Emp. Form.C22H26N6O5
Mol. Mass.454.479
SMILESCOc1ccc(cc1C(O)=O)-c1nc2c(nc(nc2[nH]1)N1CCOCC1)N1CCOC[C@@H]1C