Reaction Details
TargetSerine/threonine-protein kinase mTOR
LigandBDBM150998
Substrate/Competitorn/a
Meas. Tech.TR-FRET Tracer Assay
pH7.5±n/a
Temperature298.15±n/a K
IC50 2425±n/a nM
Commentsextracted
Citation Radetich, BYu, BZhu, Y Heterocyclic derivatives US Patent US8987257 Publication Date 3/24/2015
 
Serine/threonine-protein kinase mTOR
Name:Serine/threonine-protein kinase mTOR
Type:Rapamycin target protein
Mol. Mass.:288917.12
Organism:Homo sapiens (Human)
Description:P42345
Residue:2549
BDBM150998
NameBDBM150998
Synonyms:US8987257, 11
TypeSmall organic molecule
Emp. Form.C19H24N8O2
Mol. Mass.396.4463
SMILESNCc1cc(ccn1)-c1nc2c(nc(nc2[nH]1)N1CCOCC1)N1CCOCC1