Reaction Details
TargetSerine/threonine-protein kinase mTOR
LigandBDBM151000
Substrate/Competitorn/a
Meas. Tech.TR-FRET Tracer Assay
pH7.5±n/a
Temperature298.15±n/a K
IC50 469±n/a nM
Commentsextracted
Citation Radetich, BYu, BZhu, Y Heterocyclic derivatives US Patent US8987257 Publication Date 3/24/2015
 
Serine/threonine-protein kinase mTOR
Name:Serine/threonine-protein kinase mTOR
Type:Rapamycin target protein
Mol. Mass.:288917.12
Organism:Homo sapiens (Human)
Description:P42345
Residue:2549
BDBM151000
NameBDBM151000
Synonyms:US8987257, 13
TypeSmall organic molecule
Emp. Form.C21H24N8O2
Mol. Mass.420.4677
SMILESC[C@H]1COCCN1c1nc(nc2[nH]c(nc12)-c1cnc2cc[nH]c2c1)N1CCOCC1