Reaction Details
TargetSerine/threonine-protein kinase mTOR
LigandBDBM151004
Substrate/Competitorn/a
Meas. Tech.TR-FRET Tracer Assay
pH7.5±n/a
Temperature298.15±n/a K
IC50 399±n/a nM
Commentsextracted
Citation Radetich, BYu, BZhu, Y Heterocyclic derivatives US Patent US8987257 Publication Date 3/24/2015
 
Serine/threonine-protein kinase mTOR
Name:Serine/threonine-protein kinase mTOR
Type:Rapamycin target protein
Mol. Mass.:288917.12
Organism:Homo sapiens (Human)
Description:P42345
Residue:2549
BDBM151004
NameBDBM151004
Synonyms:US8987257, 17
TypeSmall organic molecule
Emp. Form.C23H30N6O4
Mol. Mass.454.5221
SMILESCOc1cc(CO)cc(c1)-c1nc2c(nc(nc2[nH]1)N1CCOC[C@@H]1C)N1CCOC[C@@H]1C