Reaction Details
TargetSerine/threonine-protein kinase mTOR
LigandBDBM151012
Substrate/Competitorn/a
Meas. Tech.TR-FRET Tracer Assay
pH7.5±n/a
Temperature298.15±n/a K
IC50 172±n/a nM
Commentsextracted
Citation Radetich, BYu, BZhu, Y Heterocyclic derivatives US Patent US8987257 Publication Date 3/24/2015
 
Serine/threonine-protein kinase mTOR
Name:Serine/threonine-protein kinase mTOR
Type:Rapamycin target protein
Mol. Mass.:288917.12
Organism:Homo sapiens (Human)
Description:P42345
Residue:2549
BDBM151012
NameBDBM151012
Synonyms:US8987257, 25
TypeSmall organic molecule
Emp. Form.C23H27N7O2
Mol. Mass.433.5062
SMILESCOC1CCN(CC1)c1nc(N2CCOCC2)c2nc([nH]c2n1)-c1cccc2[nH]ccc12