Reaction Details
TargetSerine/threonine-protein kinase mTOR
LigandBDBM151015
Substrate/Competitorn/a
Meas. Tech.TR-FRET Tracer Assay
pH7.5±n/a
Temperature298.15±n/a K
IC50 372±n/a nM
Commentsextracted
Citation Radetich, BYu, BZhu, Y Heterocyclic derivatives US Patent US8987257 Publication Date 3/24/2015
 
Serine/threonine-protein kinase mTOR
Name:Serine/threonine-protein kinase mTOR
Type:Rapamycin target protein
Mol. Mass.:288917.12
Organism:Homo sapiens (Human)
Description:P42345
Residue:2549
BDBM151015
NameBDBM151015
Synonyms:US8987257, 28
TypeSmall organic molecule
Emp. Form.C21H23N7O2
Mol. Mass.405.453
SMILESC1CN(CCO1)c1nc(N2CCOCC2)c2nc([nH]c2n1)-c1ccc2cc[nH]c2c1