Reaction Details
TargetSerine/threonine-protein kinase mTOR
LigandBDBM151016
Substrate/Competitorn/a
Meas. Tech.TR-FRET Tracer Assay
pH7.5±n/a
Temperature298.15±n/a K
IC50 1208±n/a nM
Commentsextracted
Citation Radetich, BYu, BZhu, Y Heterocyclic derivatives US Patent US8987257 Publication Date 3/24/2015
 
Serine/threonine-protein kinase mTOR
Name:Serine/threonine-protein kinase mTOR
Type:Rapamycin target protein
Mol. Mass.:288917.12
Organism:Homo sapiens (Human)
Description:P42345
Residue:2549
BDBM151016
NameBDBM151016
Synonyms:US8987257, 29
TypeSmall organic molecule
Emp. Form.C19H23N7O2
Mol. Mass.381.4316
SMILESNc1cccc(c1)-c1nc2c(nc(nc2[nH]1)N1CCOCC1)N1CCOCC1