Reaction Details
TargetSerine/threonine-protein kinase mTOR
LigandBDBM151019
Substrate/Competitorn/a
Meas. Tech.TR-FRET Tracer Assay
pH7.5±n/a
Temperature298.15±n/a K
IC50 1044±n/a nM
Commentsextracted
Citation Radetich, BYu, BZhu, Y Heterocyclic derivatives US Patent US8987257 Publication Date 3/24/2015
 
Serine/threonine-protein kinase mTOR
Name:Serine/threonine-protein kinase mTOR
Type:Rapamycin target protein
Mol. Mass.:288917.12
Organism:Homo sapiens (Human)
Description:P42345
Residue:2549
BDBM151019
NameBDBM151019
Synonyms:US8987257, 32
TypeSmall organic molecule
Emp. Form.C21H27N7O2
Mol. Mass.409.4848
SMILESC[C@H]1CN(C[C@@H](C)O1)c1nc(N2CCOCC2)c2nc([nH]c2n1)-c1cccc(N)c1