Reaction Details
TargetSerine/threonine-protein kinase mTOR
LigandBDBM151020
Substrate/Competitorn/a
Meas. Tech.TR-FRET Tracer Assay
pH7.5±n/a
Temperature298.15±n/a K
IC50 380±n/a nM
Commentsextracted
Citation Radetich, BYu, BZhu, Y Heterocyclic derivatives US Patent US8987257 Publication Date 3/24/2015
 
Serine/threonine-protein kinase mTOR
Name:Serine/threonine-protein kinase mTOR
Type:Rapamycin target protein
Mol. Mass.:288917.12
Organism:Homo sapiens (Human)
Description:P42345
Residue:2549
BDBM151020
NameBDBM151020
Synonyms:US8987257, 33
TypeSmall organic molecule
Emp. Form.C20H25N7O4S
Mol. Mass.459.522
SMILESCS(=O)(=O)Nc1cccc(c1)-c1nc2c(nc(nc2[nH]1)N1CCOCC1)N1CCOCC1