Reaction Details
TargetProtein-tyrosine kinase 2-beta
LigandBDBM286320
Substrate/Competitorn/a
Meas. Tech.Inhibition Assay
pH7.4±n/a
Ki 1.17±n/a nM
Commentsextracted
Citation Li, HNukui, SScales, SATeng, MYin, C Substituted pyrrolo[3,4-c]pyrazoles as PKC kinase inhibitors US Patent US9518060 Publication Date 12/13/2016
 
Protein-tyrosine kinase 2-beta
Name:Protein-tyrosine kinase 2-beta
Type:Protein
Mol. Mass.:115868.80
Organism:Homo sapiens (Human)
Description:Q14289
Residue:1009
BDBM286320
NameBDBM286320
Synonyms:US9518060, Example J6
TypeSmall organic molecule
Emp. Form.C23H33FN6O
Mol. Mass.428.5461
SMILESC[C@H]1CC(C)C(C)(C)CN1C(=O)N1Cc2c(Nc3nc(C)ccc3F)n[nH]c2C1(C)C